Target
Tubulin alpha-1A chain
Ligand
BDBM48563
Substrate
Meas. Tech.
ChEMBL_211875 (CHEMBL819257)
IC50
7300±n/a nM
Citation
 Xia, YYang, ZYXia, PHackl, THamel, EMauger, AWu, JHLee, KH Antitumor Agents. 211. Fluorinated 2-phenyl-4-quinolone derivatives as antimitotic antitumor agents. J Med Chem 44:3932-6 (2001)  
Target
Name:
Tubulin alpha-1A chain
Synonyms:
TBA1A_PIG Tubulin Tubulin alpha-1A chain
Type:
Protein
Mol. Mass.:
50049.25
Organism:
Sus scrofa (Pig)
Description:
P02550
Residue:
451
  
Inhibitor
Name:
BDBM48563
Synonyms:
2-phenyl-1H-quinolin-4-one 2-phenylquinolin-4-ol MLS000084697 cid_161091
Type:
Small organic molecule
Emp. Form.:
C15H11NO
Mol. Mass.:
221.2539
SMILES:
Oc1cc(nc2ccccc12)-c1ccccc1
: