Target
Matrix metalloproteinase-9
Ligand
BDBM50108151
Substrate
Meas. Tech.
ChEMBL_105522 (CHEMBL715231)
IC50
0.092000±n/a nM
Citation
 Wada, CKHolms, JHCurtin, MLDai, YFlorjancic, ASGarland, RBGuo, YHeyman, HRStacey, JRSteinman, DHAlbert, DHBouska, JJElmore, INGoodfellow, CLMarcotte, PATapang, PMorgan, DWMichaelides, MRDavidsen, SK Phenoxyphenyl sulfone N-formylhydroxylamines (retrohydroxamates) as potent, selective, orally bioavailable matrix metalloproteinase inhibitors. J Med Chem 45:219-32 (2001)  
Target
Name:
Matrix metalloproteinase-9
Synonyms:
67 kDa matrix metalloproteinase-9 92 kDa gelatinase CLG4B Gelatinase B MMP9 Matrix metalloproteinase 9 (MMP-9) Matrix metalloproteinase-9 (MMP9)
Type:
Enzyme
Mol. Mass.:
78452.28
Organism:
Homo sapiens (Human)
Description:
P14780
Residue:
707
  
Inhibitor
Name:
BDBM50108151
Synonyms:
CHEMBL75164 | N-{2,3-Dihydroxy-1-[4-(4-trifluoromethoxy-phenoxy)-benzenesulfonylmethyl]-propyl}-N-hydroxy-formamide
Type:
Small organic molecule
Emp. Form.:
C18H18F3NO8S
Mol. Mass.:
465.398
SMILES:
OC[C@@H](O)C(CS(=O)(=O)c1ccc(Oc2ccc(OC(F)(F)F)cc2)cc1)N(O)C=O
: