Target
Interstitial collagenase
Ligand
BDBM50063917
Substrate
Meas. Tech.
ChEMBL_106297 (CHEMBL714553)
IC50
0.780000±n/a nM
Citation
 Wada, CKHolms, JHCurtin, MLDai, YFlorjancic, ASGarland, RBGuo, YHeyman, HRStacey, JRSteinman, DHAlbert, DHBouska, JJElmore, INGoodfellow, CLMarcotte, PATapang, PMorgan, DWMichaelides, MRDavidsen, SK Phenoxyphenyl sulfone N-formylhydroxylamines (retrohydroxamates) as potent, selective, orally bioavailable matrix metalloproteinase inhibitors. J Med Chem 45:219-32 (2001)  
Target
Name:
Interstitial collagenase
Synonyms:
CLG MMP1 Matrix metalloproteinase-1 | Matrix metalloproteinase-1 (MMP-1)
Type:
Enzyme
Mol. Mass.:
54010.26
Organism:
Homo sapiens (Human)
Description:
P03956
Residue:
469
  
Inhibitor
Name:
BDBM50063917
Synonyms:
(2S,3R)-N(4)-[(2S)-3,3-dimethyl-1-(methylamino)-1-oxobutan-2-yl]-N(1),2-dihydroxy-3-(2-methylpropyl)butanediamide cid_119031 | marimastat
Type:
Small organic molecule
Emp. Form.:
C15H29N3O5
Mol. Mass.:
331.4079
SMILES:
CNC(=O)[C@@H](NC(=O)[C@H](CC(C)C)[C@H](O)C(=O)NO)C(C)(C)C
: