Target
Sorbitol dehydrogenase
Ligand
BDBM50108729
Substrate
Meas. Tech.
ChEMBL_201003 (CHEMBL801253)
IC50
110±n/a nM
Citation
 Chu-Moyer, MYBallinger, WEBeebe, DABerger, RCoutcher, JBDay, WWLi, JMylari, BLOates, PJWeekly, RM Orally-effective, long-acting sorbitol dehydrogenase inhibitors: synthesis, structure-activity relationships, and in vivo evaluations of novel heterocycle-substituted piperazino-pyrimidines. J Med Chem 45:511-28 (2002)  
Target
Name:
Sorbitol dehydrogenase
Synonyms:
DHSO_HUMAN SORD
Type:
PROTEIN
Mol. Mass.:
38332.20
Organism:
Homo sapiens (Human)
Description:
ChEMBL_223910
Residue:
357
  
Inhibitor
Name:
BDBM50108729
Synonyms:
1-{4-[4-(4-Methyl-pyrimidin-2-yl)-piperazin-1-yl]-pyrimidin-2-yl}-ethanol | CHEMBL347575
Type:
Small organic molecule
Emp. Form.:
C15H20N6O
Mol. Mass.:
300.3589
SMILES:
C[C@@H](O)c1nccc(n1)N1CCN(CC1)c1nccc(C)n1
: