Target
Sorbitol dehydrogenase
Ligand
BDBM50108748
Substrate
Meas. Tech.
ChEMBL_201003 (CHEMBL801253)
IC50
150±n/a nM
Citation
 Chu-Moyer, MYBallinger, WEBeebe, DABerger, RCoutcher, JBDay, WWLi, JMylari, BLOates, PJWeekly, RM Orally-effective, long-acting sorbitol dehydrogenase inhibitors: synthesis, structure-activity relationships, and in vivo evaluations of novel heterocycle-substituted piperazino-pyrimidines. J Med Chem 45:511-28 (2002)  
Target
Name:
Sorbitol dehydrogenase
Synonyms:
DHSO_HUMAN SORD
Type:
PROTEIN
Mol. Mass.:
38332.20
Organism:
Homo sapiens (Human)
Description:
ChEMBL_223910
Residue:
357
  
Inhibitor
Name:
BDBM50108748
Synonyms:
CHEMBL358327 | [4-(4-Isoquinolin-1-yl-piperazin-1-yl)-pyrimidin-2-yl]-methanol
Type:
Small organic molecule
Emp. Form.:
C18H19N5O
Mol. Mass.:
321.3764
SMILES:
OCc1nccc(n1)N1CCN(CC1)c1nccc2ccccc12
: