Target
Cruzipain
Ligand
BDBM50108846
Substrate
Meas. Tech.
ChEMBL_51847 (CHEMBL664070)
Ki
1.4±n/a nM
Citation
 Huang, LLee, AEllman, JA Identification of potent and selective mechanism-based inhibitors of the cysteine protease cruzain using solid-phase parallel synthesis. J Med Chem 45:676-84 (2002)  
Target
Name:
Cruzipain
Synonyms:
CYSP_TRYCR Cruzaine | Major cysteine proteinase
Type:
Protein
Mol. Mass.:
49831.41
Organism:
Trypanosoma cruzi
Description:
P25779
Residue:
467
  
Inhibitor
Name:
BDBM50108846
Synonyms:
CHEMBL161038 | [1-(3-tert-Butylsulfanyl-2-oxo-1-phenethyl-propylcarbamoyl)-2-phenyl-ethyl]-carbamic acid pyridin-3-ylmethyl ester
Type:
Small organic molecule
Emp. Form.:
C31H37N3O4S
Mol. Mass.:
547.708
SMILES:
CC(C)(C)SCC(=O)[C@H](CCc1ccccc1)NC(=O)[C@H](Cc1ccccc1)NC(=O)OCc1cccnc1
: