Target
Cruzipain
Ligand
BDBM50108858
Substrate
Meas. Tech.
ChEMBL_51847 (CHEMBL664070)
Ki
0.9±n/a nM
Citation
 Huang, LLee, AEllman, JA Identification of potent and selective mechanism-based inhibitors of the cysteine protease cruzain using solid-phase parallel synthesis. J Med Chem 45:676-84 (2002)  
Target
Name:
Cruzipain
Synonyms:
CYSP_TRYCR Cruzaine | Major cysteine proteinase
Type:
Protein
Mol. Mass.:
49831.41
Organism:
Trypanosoma cruzi
Description:
P25779
Residue:
467
  
Inhibitor
Name:
BDBM50108858
Synonyms:
CHEMBL347459 | {1-[2-Oxo-1-phenethyl-3-(3-phenyl-propylsulfanyl)-propylcarbamoyl]-2-phenyl-ethyl}-carbamic acid pyridin-3-ylmethyl ester
Type:
Small organic molecule
Emp. Form.:
C36H39N3O4S
Mol. Mass.:
609.778
SMILES:
O=C(N[C@@H](Cc1ccccc1)C(=O)N[C@@H](CCc1ccccc1)C(=O)CSCCCc1ccccc1)OCc1cccnc1
: