Target
Catechol O-methyltransferase
Ligand
BDBM50108879
Substrate
Meas. Tech.
ChEMBL_47067 (CHEMBL661108)
IC50
2320000±n/a nM
Citation
 Learmonth, DAVieira-Coelho, MABenes, JAlves, PCBorges, NFreitas, APda-Silva, PS Synthesis of 1-(3,4-dihydroxy-5-nitrophenyl)-2-phenyl-ethanone and derivatives as potent and long-acting peripheral inhibitors of catechol-O-methyltransferase. J Med Chem 45:685-95 (2002)  
Target
Name:
Catechol O-methyltransferase
Synonyms:
COMT_RAT Catechol-O-methyltransferase | Comt
Type:
Enzyme
Mol. Mass.:
29594.09
Organism:
Rattus norvegicus (Rat)
Description:
Residue:
264
  
Inhibitor
Name:
BDBM50108879
Synonyms:
(2E)-2-cyano-3-(3,4-dihydroxy-5-nitrophenyl)-N,N-diethylprop-2-enamide CHEMBL953 ENTACAPONE | N,N-diethyl-2-cyano-3-(3,4-dihydroxy-5-nitrophenyl) acrylamide
Type:
Small organic molecule
Emp. Form.:
C14H15N3O5
Mol. Mass.:
305.286
SMILES:
CCN(CC)C(=O)C(=C\c1cc(O)c(O)c(c1)[N+]([O-])=O)\C#N
: