Target
Kynurenine 3-monooxygenase
Ligand
BDBM50549705
Substrate
Meas. Tech.
ChEMBL_2025621 (CHEMBL4679434)
IC50
2.0±n/a nM
Citation
 Kimura, HSuda, HKassai, MEndo, MDeai, YYahata, MMiyajima, MIsobe, Y N-(6-phenylpyridazin-3-yl)benzenesulfonamides as highly potent, brain-permeable, and orally active kynurenine monooxygenase inhibitors. Bioorg Med Chem Lett 33:0 (2021)  
Target
Name:
Kynurenine 3-monooxygenase
Synonyms:
KMO | KMO_HUMAN
Type:
PROTEIN
Mol. Mass.:
55831.03
Organism:
Homo sapiens (Human)
Description:
ChEMBL_1487479
Residue:
486
  
Inhibitor
Name:
BDBM50549705
Synonyms:
CHEMBL4756311
Type:
Small organic molecule
Emp. Form.:
C20H20N4O2S
Mol. Mass.:
380.463
SMILES:
CN1CCc2cccc(c12)-c1ccc(NS(=O)(=O)c2ccc(C)cc2)nn1
: