Target
Alpha-1A/Alpha-1B/Alpha-1D adrenergic receptor
Ligand
BDBM50109058
Substrate
Meas. Tech.
ChEMBL_32416 (CHEMBL876575)
Ki
0.190000±n/a nM
Citation
 Mewshaw, REMeagher, KLZhou, PZhou, DShi, XScerni, RSmith, DSchechter, LEAndree, TH Studies toward the discovery of the next generation of antidepressants. Part 2: incorporating a 5-HT(1A) antagonist component into a class of serotonin reuptake inhibitors. Bioorg Med Chem Lett 12:307-10 (2002)  
Target
Name:
Alpha-1A/Alpha-1B/Alpha-1D adrenergic receptor
Synonyms:
Adrenergic receptor alpha-1 alpha-1 Adrenergic Receptor
Type:
Mol. Mass.:
Description:
ASSAY_ID of EBI is 303470
Components:
This complex has 3 components.
Component 1
Name:
Alpha-1B adrenergic receptor
Synonyms:
ADA1B_RAT Alpha 1B-adrenoceptor Alpha adrenergic receptor 1A and 1B Alpha-1Adrenoceptor Alpha-1B adrenoreceptor | adrenergic Alpha1B
Type:
G Protein-Coupled Receptor (GPCR)
Mol. Mass.:
56606.71
Organism:
Rattus norvegicus (rat)
Description:
Receptor binding assays were performed using rat cortical membranes.
Residue:
515
  
Component 2
Name:
Alpha-1A adrenergic receptor
Synonyms:
ADA1A_RAT Adra1c Alpha-1A adrenoceptor Alpha-1C adrenergic receptor | adrenergic Alpha1A
Type:
Protein
Mol. Mass.:
51620.15
Organism:
Rattus norvegicus (Rat)
Description:
P43140
Residue:
466
  
Component 3
Name:
Alpha-1D adrenergic receptor
Synonyms:
ADA1D_RAT Adra1d Alpha-1D adrenergic receptor | Serotonin 1a (5-HT1a) receptor/Adrenergic receptor alpha-1
Type:
Protein
Mol. Mass.:
59375.97
Organism:
Rattus norvegicus (Rat)
Description:
P23944
Residue:
561
  
Inhibitor
Name:
BDBM50109058
Synonyms:
1H-4-indolyl 2-[4-(1H-3-indolyl)-1,2,3,6-tetrahydro-1-pyridinyl]ethyl ether | CHEMBL421027
Type:
Small organic molecule
Emp. Form.:
C23H23N3O
Mol. Mass.:
357.4482
SMILES:
C(CN1CCC(=CC1)c1c[nH]c2ccccc12)Oc1cccc2[nH]ccc12
: