Target
Urokinase-type plasminogen activator
Ligand
BDBM50109377
Substrate
Meas. Tech.
ChEBML_212981
Ki
58±n/a nM
Citation
 Rudolph, MJIllig, CRSubasinghe, NLWilson, KJHoffman, JBRandle, TGreen, DMolloy, CJSoll, RMLewandowski, FZhang, MBone, RSpurlino, JCDeckman, ICManthey, CSharp, CMaguire, DGrasberger, BLDesJarlais, RLZhou, Z Design and synthesis of 4,5-disubstituted-thiophene-2-amidines as potent urokinase inhibitors. Bioorg Med Chem Lett 12:491-5 (2002)  
Target
Name:
Urokinase-type plasminogen activator
Synonyms:
PLAU UROK_HUMAN Urokinase-type plasminogen activator (uPA) | Urokinase-type plasminogen activator/surface receptor
Type:
Enzyme
Mol. Mass.:
48528.62
Organism:
Homo sapiens (Human)
Description:
P00749
Residue:
431
  
Inhibitor
Name:
BDBM50109377
Synonyms:
4-[4-(3,4-Dimethoxy-phenyl)-thiazol-2-yl]-5-methylsulfanyl-thiophene-2-carboxamidine | CHEMBL147427
Type:
Small organic molecule
Emp. Form.:
C17H17N3O2S3
Mol. Mass.:
391.531
SMILES:
COc1ccc(cc1OC)-c1csc(n1)-c1cc(sc1SC)C(N)=N
: