Target
Peroxisome proliferator-activated receptor delta
Ligand
BDBM28701
Substrate
Meas. Tech.
ChEMBL_220890 (CHEMBL824645)
EC50
102000±n/a nM
Citation
 Sauerberg, PPettersson, IJeppesen, LBury, PSMogensen, JPWassermann, KBrand, CLSturis, JWöldike, HFFleckner, JAndersen, ASMortensen, SBSvensson, LARasmussen, HBLehmann, SVPolivka, ZSindelar, KPanajotova, VYnddal, LWulff, EM Novel tricyclic-alpha-alkyloxyphenylpropionic acids: dual PPARalpha/gamma agonists with hypolipidemic and antidiabetic activity. J Med Chem 45:789-804 (2002)  
Target
Name:
Peroxisome proliferator-activated receptor delta
Synonyms:
NR1C2 NUCI Nuclear receptor subfamily 1 group C member 2 PPAR-beta PPARD Peroxisome proliferator-activated receptor Peroxisome proliferator-activated receptor delta
Type:
Enzyme
Mol. Mass.:
49910.45
Organism:
Homo sapiens (Human)
Description:
Q03181
Residue:
441
  
Inhibitor
Name:
BDBM28701
Synonyms:
2-(4-{2-[(4-chlorophenyl)formamido]ethyl}phenoxy)-2-methylpropanoic acid Bezafibrate Cedur | Sklerofibrat
Type:
Small organic molecule
Emp. Form.:
C19H20ClNO4
Mol. Mass.:
361.819
SMILES:
CC(C)(Oc1ccc(CCNC(=O)c2ccc(Cl)cc2)cc1)C(O)=O
: