Target
Isoform 1 of Calcitonin receptor (1)
Ligand
BDBM50110273
Substrate
Meas. Tech.
ChEMBL_42610 (CHEMBL654175)
Ki
0.560000±n/a nM
Citation
 Taylor, JWJin, QKSbacchi, MWang, LBelfiore, PGarnier, MKazantzis, AKapurniotu, AZaratin, PFScheideler, MA Side-chain lactam-bridge conformational constraints differentiate the activities of salmon and human calcitonins and reveal a new design concept for potent calcitonin analogues. J Med Chem 45:1108-21 (2002)  
Target
Name:
Isoform 1 of Calcitonin receptor (1)
Synonyms:
CALCR CT-R Calcitonin receptor (1)
Type:
PROTEIN
Mol. Mass.:
55343.05
Organism:
Homo sapiens (Human)
Description:
ChEMBL_42610
Residue:
474
  
Inhibitor
Name:
BDBM50110273
Synonyms:
CGNLSTCMLGTYTQDFc[DKFHK]FPQTAIGVGAP-amide | CHEMBL2369893
Type:
Small organic molecule
Emp. Form.:
C152H229N39O43S2
Mol. Mass.:
3354.81
SMILES:
CCCC[C@H](NC(=O)[C@H](CS)NC(=O)[C@@H](NC(=O)[C@H](CO)NC(=O)[C@H](CC(C)C)NC(=O)[C@H](CC(N)=O)NC(=O)CNC(=O)[C@@H](N)CS)[C@@H](C)O)C(=O)N[C@@H](CC(C)C)C(=O)NCC(=O)N[C@@H]([C@@H](C)O)C(=O)N[C@@H](Cc1ccccc1)C(=O)N[C@@H]([C@@H](C)O)C(=O)N[C@@H](CCC(N)=O)C(=O)N[C@@H](CC(O)=O)C(=O)N[C@@H](Cc1ccccc1)C(=O)N[C@H]1CC(=O)NCCC[C@H](NC(Cc2c[nH]cn2)C(=O)N[C@@H](Cc2ccccc2)C(=O)[C@H](CCCCN)NC1=O)C(=O)N[C@@H](Cc1ccc(O)cc1)C(=O)N1CCC[C@@H]1C(=O)N[C@@H](CCC(N)=O)C(=O)N[C@@H]([C@@H](C)O)C(=O)N[C@@H](C)C(=O)N[C@@H]([C@@H](C)CC)C(=O)NCC(=O)N[C@@H](C(C)C)C(=O)NCC(=O)N[C@@H](C)C(=O)N1CCC[C@@H]1C(N)=O
: