Target
cGMP-specific 3',5'-cyclic phosphodiesterase
Ligand
BDBM14390
Substrate
Meas. Tech.
ChEBML_155211
IC50
6.6±n/a nM
Citation
 Haning, HNiewöhner, USchenke, TEs-Sayed, MSchmidt, GLampe, TBischoff, E Imidazo[5,1-f]triazin-4(3H)-ones, a new class of potent PDE 5 inhibitors. Bioorg Med Chem Lett 12:865-8 (2002)  
Target
Name:
cGMP-specific 3',5'-cyclic phosphodiesterase
Synonyms:
3',5'-cyclic phosphodiesterase PDE5 PDE5A_HUMAN Phosphodiesterase 5 (PDE5) Phosphodiesterase 5A (PDE5A) cGMP-specific 3',5'-cyclic phosphodiesterase
Type:
Protein
Mol. Mass.:
99975.83
Organism:
Homo sapiens (Human)
Description:
O76074
Residue:
875
  
Inhibitor
Name:
BDBM14390
Synonyms:
5-[2-ethoxy-5-(4-methyl-1-piperazinylsulfonyl)phenyl]-1-methyl-3-n-propyl-1,6-dihydro-7H-pyrazolo[4,3-d]pyrimidin-7-one CHEMBL192 Sildenafil US11155558, Compound sildenafil Viagra
Type:
Small organic molecule
Emp. Form.:
C22H30N6O4S
Mol. Mass.:
474.576
SMILES:
CCCc1nn(C)c2c1nc([nH]c2=O)-c1cc(ccc1OCC)S(=O)(=O)N1CCN(C)CC1
: