Target
Sorbitol dehydrogenase
Ligand
BDBM50113497
Substrate
Meas. Tech.
ChEMBL_201007 (CHEMBL801928)
IC50
5±n/a nM
Citation
 Chu-Moyer, MYBallinger, WEBeebe, DACoutcher, JBDay, WWLi, JOates, PJWeekly, RM SAR and species/stereo-selective metabolism of the sorbitol dehydrogenase inhibitor, CP-470,711. Bioorg Med Chem Lett 12:1477-80 (2002)  
Target
Name:
Sorbitol dehydrogenase
Synonyms:
DHSO_RAT Sord
Type:
PROTEIN
Mol. Mass.:
38239.67
Organism:
Rattus norvegicus
Description:
ChEMBL_223914
Residue:
357
  
Inhibitor
Name:
BDBM50113497
Synonyms:
1-(4-{(2S,6R)-4-[2-((R)-1-Hydroxy-ethyl)-pyrimidin-4-yl]-2,6-dimethyl-piperazin-1-yl}-pyrimidin-2-yl)-ethanone | CHEMBL34667
Type:
Small organic molecule
Emp. Form.:
C18H24N6O2
Mol. Mass.:
356.4222
SMILES:
C[C@@H](O)c1nccc(n1)N1C[C@H](C)N([C@H](C)C1)c1ccnc(n1)C(C)=O
: