Target
Potassium voltage-gated channel subfamily H member 2
Ligand
BDBM50114951
Substrate
Meas. Tech.
ChEBML_205711
Ki
950±n/a nM
Citation
 Cooper, LCCarlson, EJCastro, JLChicchi, GGDinnell, KDi Salvo, JElliott, JMHollingworth, GJKurtz, MMRidgill, MPRycroft, WTsao, KLSwain, CJ 4,4-Disubstituted cyclohexylamine NK(1) receptor antagonists II. Bioorg Med Chem Lett 12:1759-62 (2002)  
Target
Name:
Potassium voltage-gated channel subfamily H member 2
Synonyms:
1,3-beta-glucan synthase component GLS2 ERG Eag-related protein 1 Ether-a-go-go-related gene (HERG) Ether-a-go-go-related gene potassium channel 1 Ether-a-go-go-related gene potassium channel 1 (hERG1) Ether-a-go-go-related protein 1 H-ERG KCNH2 Potassium voltage-gated channel subfamily H member 2 (hERG) Voltage-gated potassium channel subunit Kv11.1 hERG Potassium Channel 1 | putative potassium channel subunit
Type:
Multi-pass membrane protein
Mol. Mass.:
126672.65
Organism:
Homo sapiens (Human)
Description:
Q12809
Residue:
1159
  
Inhibitor
Name:
BDBM50114951
Synonyms:
2-(3,5-Bis-trifluoromethyl-phenyl)-N-[4-(2,2-dimethyl-1-oxa-8-aza-spiro[4.5]dec-8-yl)-1-phenyl-cyclohexyl]-propionamide | CHEMBL3085132
Type:
Small organic molecule
Emp. Form.:
C33H40F6N2O2
Mol. Mass.:
610.6733
SMILES:
CC(C(=O)NC1(CCC(CC1)N1CCC2(CCC(C)(C)O2)CC1)c1ccccc1)c1cc(cc(c1)C(F)(F)F)C(F)(F)F
: