Target
Sodium-dependent dopamine transporter
Ligand
BDBM50118601
Substrate
Meas. Tech.
ChEMBL_62946 (CHEMBL675530)
Ki
0.99±n/a nM
Citation
 Prisinzano, TGreiner, EJohnson, EMDersch, CMMarcus, JPartilla, JSRothman, RBJacobson, AERice, KC Piperidine analogues of 1-[2-[bis(4-fluorophenyl)methoxy]ethyl]-4-(3-phenylpropyl)piperazine (GBR 12909): high affinity ligands for the dopamine transporter. J Med Chem 45:4371-4 (2002)  
Target
Name:
Sodium-dependent dopamine transporter
Synonyms:
DA transporter DAT1 Dopamine transporter protein (DAT) SC6A3_HUMAN Sodium-dependent dopamine transporter Solute carrier family 6 member 3
Type:
Multi-pass membrane protein
Mol. Mass.:
68497.11
Organism:
Homo sapiens (Human)
Description:
Q01959
Residue:
620
  
Inhibitor
Name:
BDBM50118601
Synonyms:
4-{2-[Bis-(4-fluoro-phenyl)-methoxy]-ethyl}-1-(3-furan-2-yl-allyl)-piperidine | CHEMBL136057
Type:
Small organic molecule
Emp. Form.:
C27H29F2NO2
Mol. Mass.:
437.5215
SMILES:
Fc1ccc(cc1)C(OCCC1CCN(C\C=C\c2ccco2)CC1)c1ccc(F)cc1
: