Target
Sorbitol dehydrogenase
Ligand
BDBM50113496
Substrate
Meas. Tech.
ChEMBL_223917 (CHEMBL846063)
IC50
11±n/a nM
Citation
 Mylari, BLOates, PJZembrowski, WJBeebe, DAConn, ELCoutcher, JBO'Gorman, MTLinhares, MCWithbroe, GJ A sorbitol dehydrogenase inhibitor of exceptional in vivo potency with a long duration of action: 1-(R)-[4-[4-(4,6-dimethyl[1,3,5]triazin-2-yl)- 2R,6S-dimethylpiperazin-1-yl]pyrimidin-2- yl]ethanol. J Med Chem 45:4398-401 (2002)  
Target
Name:
Sorbitol dehydrogenase
Synonyms:
DHSO_RAT Sord
Type:
PROTEIN
Mol. Mass.:
38239.67
Organism:
Rattus norvegicus
Description:
ChEMBL_223914
Residue:
357
  
Inhibitor
Name:
BDBM50113496
Synonyms:
(S)-1-(4-{(3S,5R)-4-[2-((R)-1-Hydroxy-ethyl)-pyrimidin-4-yl]-3,5-dimethyl-piperazin-1-yl}-pyrimidin-2-yl)-ethanol CHEMBL287890
Type:
Small organic molecule
Emp. Form.:
C18H26N6O2
Mol. Mass.:
358.438
SMILES:
C[C@H](O)c1nccc(n1)N1C[C@H](C)N([C@H](C)C1)c1ccnc(n1)[C@@H](C)O
: