Target
Nuclear receptor ROR-gamma
Ligand
BDBM20192
Substrate
Meas. Tech.
ChEMBL_2059672 (CHEMBL4714673)
EC50
418±n/a nM
Citation
 Meijer, FAvan den Oetelaar, MCMDoveston, RGSampers, ENRBrunsveld, L Covalent Occlusion of the ROR?t Ligand Binding Pocket Allows Unambiguous Targeting of an Allosteric Site. ACS Med Chem Lett 12:631-639 (2021)  
Target
Name:
Nuclear receptor ROR-gamma
Synonyms:
NR1F3 Nuclear receptor ROR-gamma (RORC) RAR-related orphan receptor C (RORc) RORG RZRG Retinoid-related orphan receptor-gamma (RORc)
Type:
Enzyme Catalytic Domain
Mol. Mass.:
58218.40
Organism:
Homo sapiens (Human)
Description:
P51449
Residue:
518
  
Inhibitor
Name:
BDBM20192
Synonyms:
(1S,2R,5S,10S,11S,14R,15R)-2,15-dimethyl-14-[(2R)-6-methylheptan-2-yl]tetracyclo[8.7.0.0^{2,7}.0^{11,15}]heptadec-7-en-5-ol | cholesterol
Type:
Steroid
Emp. Form.:
C27H46O
Mol. Mass.:
386.6535
SMILES:
[H][C@@]1(CC[C@@]2([H])[C@]3([H])CC=C4C[C@@H](O)CC[C@]4(C)[C@@]3([H])CC[C@]12C)[C@H](C)CCCC(C)C
: