Target
Melanocortin receptor 4
Ligand
BDBM50119367
Substrate
Meas. Tech.
ChEMBL_104242 (CHEMBL712747)
IC50
0.300000±n/a nM
Citation
 Sebhat, IKMartin, WJYe, ZBarakat, KMosley, RTJohnston, DBBakshi, RPalucki, BWeinberg, DHMacNeil, TKalyani, RNTang, RStearns, RAMiller, RRTamvakopoulos, CStrack, AMMcGowan, ECashen, DEDrisko, JEHom, GJHoward, ADMacIntyre, DEvan der Ploeg, LHPatchett, AANargund, RP Design and pharmacology of N-[(3R)-1,2,3,4-tetrahydroisoquinolinium- 3-ylcarbonyl]-(1R)-1-(4-chlorobenzyl)- 2-[4-cyclohexyl-4-(1H-1,2,4-triazol- 1-ylmethyl)piperidin-1-yl]-2-oxoethylamine (1), a potent, selective, melanocortin subtype-4 receptor agonist. J Med Chem 45:4589-93 (2002)  
Target
Name:
Melanocortin receptor 4
Synonyms:
MC4-R MC4R_HUMAN Melanocortin receptor 4 (MC-4) Melanocortin receptor 4 (MC4R)
Type:
Enzyme
Mol. Mass.:
36949.50
Organism:
Homo sapiens (Human)
Description:
P32245
Residue:
332
  
Inhibitor
Name:
BDBM50119367
Synonyms:
(3R)-N-[(2R)-3-(4-chlorophenyl)-1-{4-cyclohexyl-4-[(1-methyl-1H-1,2,3,4-tetrazol-5-yl)methyl]piperidin-1-yl}-1-oxopropan-2-yl]-1,2,3,4-tetrahydroisoquinoline-3-carboxamide CHEMBL140154
Type:
Small organic molecule
Emp. Form.:
C33H42ClN7O2
Mol. Mass.:
604.185
SMILES:
Cn1nnnc1CC1(CCN(CC1)C(=O)[C@@H](Cc1ccc(Cl)cc1)NC(=O)[C@H]1Cc2ccccc2CN1)C1CCCCC1
: