Target
Growth hormone secretagogue receptor type 1
Ligand
BDBM50120505
Substrate
Meas. Tech.
ChEBML_89487
Ki
5±n/a nM
Citation
 Carpino, PALefker, BAToler, SMPan, LCHadcock, JRMurray, MCCook, ERDiBrino, JNDeNinno, SLChidsey-Frink, KLHada, WAInthavongsay, JLewis, SKMangano, FMMullins, MANickerson, DFNg, OPirie, CMRagan, JARose, CRTess, DAWright, ASYu, LZawistoski, MPPettersen, JCDaSilva-Jardine, PAWilson, TCThompson, DD Discovery and biological characterization of capromorelin analogues with extended half-lives. Bioorg Med Chem Lett 12:3279-82 (2002)  
Target
Name:
Growth hormone secretagogue receptor type 1
Synonyms:
GH-releasing peptide receptor GHS-R GHSR_HUMAN Ghrelin receptor | Ghrelin receptor 1a (GHS-R1a)
Type:
Receptor
Mol. Mass.:
41334.57
Organism:
Homo sapiens (Human)
Description:
Receptor binding studies use plasma membranes from LLC PK-1 cells transiently transfected with hGHSR1a.
Residue:
366
  
Inhibitor
Name:
BDBM50120505
Synonyms:
2-Amino-N-{(R)-1-(2,4-difluoro-benzyloxymethyl)-2-oxo-2-[(R)-3-oxo-3a-pyridin-2-ylmethyl-2-(2,2,2-trifluoro-ethyl)-2,3,3a,4,6,7-hexahydro-pyrazolo[4,3-c]pyridin-5-yl]-ethyl}-2-methyl-propionamide CP-464709-18
Type:
Small organic molecule
Emp. Form.:
C28H31F5N6O4
Mol. Mass.:
610.5756
SMILES:
CC(C)(N)C(=O)N[C@H](COCc1ccc(F)cc1F)C(=O)N1CCC2=NN(CC(F)(F)F)C(=O)[C@]2(Cc2ccccn2)C1
: