Target
Integrase
Ligand
BDBM50559797
Substrate
Meas. Tech.
ChEMBL_2070418 (CHEMBL4725952)
Ki
8.0±n/a nM
Citation
 Patel, MNaidu, BNDicker, IHigley, HLin, ZTerry, BProtack, TKrystal, MJenkins, SParker, DPanja, CRampulla, RMathur, AMeanwell, NAWalker, MA Design, synthesis and SAR study of bridged tricyclic pyrimidinone carboxamides as HIV-1 integrase inhibitors. Bioorg Med Chem 28:0 (2020)  
Target
Name:
Integrase
Synonyms:
Integrase | int
Type:
PROTEIN
Mol. Mass.:
32028.36
Organism:
Human immunodeficiency virus 1
Description:
ChEMBL_118431
Residue:
286
  
Inhibitor
Name:
BDBM50559797
Synonyms:
CHEMBL4786078
Type:
Small organic molecule
Emp. Form.:
C24H28FN5O5
Mol. Mass.:
485.508
SMILES:
CN(C)C(=O)C(=O)NC12CCC(CC1)Cn1c2nc(C(=O)NCc2ccc(F)c(C)c2)c(O)c1=O
: