Target
5-hydroxytryptamine receptor 1A
Ligand
BDBM50122242
Substrate
Meas. Tech.
ChEBML_1141
Ki
0.160000±n/a nM
Citation
 Betti, LFloridi, MGiannaccini, GManetti, FStrappaghetti, GTafi, ABotta, M alpha1-Adrenoceptor antagonists. 5. Pyridazinone-arylpiperazines. Probing the influence on affinity and selectivity of both ortho-alkoxy groups at the arylpiperazine moiety and cyclic substituents at the pyridazinone nucleus. Bioorg Med Chem Lett 13:171-3 (2002)  
Target
Name:
5-hydroxytryptamine receptor 1A
Synonyms:
5-HT-1A 5-HT1A 5-hydroxytryptamine receptor 1A (5HT1A) 5ht1a Htr1a Serotonin 1a (5-HT1a) receptor/Adrenergic receptor alpha-1 | Serotonin receptor 1A
Type:
G Protein-Coupled Receptor (GPCR)
Mol. Mass.:
46445.29
Organism:
Rattus norvegicus (rat)
Description:
Binding assays were performed using rat hippocampal membranes.
Residue:
422
  
Inhibitor
Name:
BDBM50122242
Synonyms:
4-Chloro-5-{4-[2-(2-ethoxy-phenoxy)-ethyl]-piperazin-1-yl}-2-{7-[4-(2-methoxy-phenyl)-piperazin-1-yl]-heptyl}-2H-pyridazin-3-one CHEMBL48163
Type:
Small organic molecule
Emp. Form.:
C36H51ClN6O4
Mol. Mass.:
667.281
SMILES:
CCOc1ccccc1OCCN1CCN(CC1)c1cnn(CCCCCCCN2CCN(CC2)c2ccccc2OC)c(=O)c1Cl
: