Target
Retinoic acid receptor gamma
Ligand
BDBM31892
Substrate
Meas. Tech.
ChEMBL_195989 (CHEMBL807694)
EC50
50±n/a nM
Citation
 Farmer, LJZhi, LJeong, SLamph, WWOsburn, DLCroston, GFlatten, KSHeyman, RANadzan, AM Retinoic acid receptor ligands based on the 6-cyclopropyl-2,4-hexadienoic acid. Bioorg Med Chem Lett 13:261-4 (2002)  
Target
Name:
Retinoic acid receptor gamma
Synonyms:
NR1B3 RAR-gamma RARG_HUMAN Retinoic acid receptor gamma | Retinoid receptor
Type:
PROTEIN
Mol. Mass.:
50345.43
Organism:
Homo sapiens (Human)
Description:
ChEMBL_1458016
Residue:
454
  
Inhibitor
Name:
BDBM31892
Synonyms:
9-cis retinoic acid CHEMBL705 alitretinoin
Type:
Small organic molecule
Emp. Form.:
C20H28O2
Mol. Mass.:
300.4351
SMILES:
C\C(\C=C\C1=C(C)CCCC1(C)C)=C\C=C\C(\C)=C\C(O)=O
: