Target
Tumor necrosis factor receptor superfamily member 1A
Ligand
BDBM50123311
Substrate
Meas. Tech.
ChEBML_212214
IC50
4500±n/a nM
Citation
 Voss, MECarter, PHTebben, AJScherle, PABrown, GDThompson, LAXu, MLo, YCYang, GLiu, RQStrzemienski, PEverlof, JGTrzaskos, JMDecicco, CP Both 5-arylidene-2-thioxodihydropyrimidine-4,6(1H,5H)-diones and 3-thioxo-2,3-dihydro-1H-imidazo[1,5-a]indol-1-ones are light-dependent tumor necrosis factor-alpha antagonists. Bioorg Med Chem Lett 13:533-8 (2003)  
Target
Name:
Tumor necrosis factor receptor superfamily member 1A
Synonyms:
CD_antigen=CD120a TNF-R1 TNFAR TNFR1 TNR1A_HUMAN Tumor necrosis factor receptor superfamily member 1A Tumor necrosis factor-binding protein 1 p60
Type:
PROTEIN
Mol. Mass.:
50495.39
Organism:
Homo sapiens (Human)
Description:
ChEMBL_1509419
Residue:
455
  
Inhibitor
Name:
BDBM50123311
Synonyms:
5-(5-Bromo-thiophen-2-ylmethylene)-1,3-diethyl-2-thioxo-dihydro-pyrimidine-4,6-dione | CHEMBL151107
Type:
Small organic molecule
Emp. Form.:
C13H13BrN2O2S2
Mol. Mass.:
373.289
SMILES:
[#6]-[#6]-[#7]-1-[#6](=S)-[#7](-[#6]-[#6])-[#6](=O)\[#6](=[#6]\c2ccc(Br)s2)-[#6]-1=O
: