Target
D(2) dopamine receptor
Ligand
BDBM50123626
Substrate
Meas. Tech.
ChEMBL_59476 (CHEMBL671436)
Ki
15±n/a nM
Citation
 Venhuis, BJDijkstra, DWustrow, DJMeltzer, LTWise, LDJohnson, SJHeffner, TGWikström, HV Orally active analogues of the dopaminergic prodrug 6-(N,N-di-n-propylamino)-3,4,5,6,7,8-hexahydro-2H-naphthalen-1-one: synthesis and pharmacological activity. J Med Chem 46:584-90 (2003)  
Target
Name:
D(2) dopamine receptor
Synonyms:
DOPAMINE D2 DRD2_BOVIN | Dopamine D2 receptor
Type:
Enzyme Catalytic Domain
Mol. Mass.:
50698.79
Organism:
BOVINE
Description:
P20288
Residue:
444
  
Inhibitor
Name:
BDBM50123626
Synonyms:
(S)-6-[Propyl-(2-thiophen-2-yl-ethyl)-amino]-5,6,7,8-tetrahydro-naphthalen-1-ol Neupro | ROTIGOTINE
Type:
Small organic molecule
Emp. Form.:
C19H25NOS
Mol. Mass.:
315.473
SMILES:
CCCN(CCc1cccs1)[C@H]1CCc2c(O)cccc2C1
: