Target
Sodium-dependent serotonin transporter
Ligand
BDBM50124565
Substrate
Meas. Tech.
ChEMBL_201488 (CHEMBL805619)
Ki
0.12±n/a nM
Citation
 Goodman, MMChen, PPlisson, CMartarello, LGalt, JVotaw, JRKilts, CDMalveaux, GCamp, VMShi, BEly, TDHowell, LMcConathy, JNemeroff, CB Synthesis and characterization of iodine-123 labeled 2beta-carbomethoxy-3beta-(4'-((Z)-2-iodoethenyl)phenyl)nortropane. A ligand for in vivo imaging of serotonin transporters by single-photon-emission tomography. J Med Chem 46:925-35 (2003)  
Target
Name:
Sodium-dependent serotonin transporter
Synonyms:
5-HT Transporter 5HTT SC6A4_HUMAN SLC6A4 Serotonin transporter (5HTT) Sodium-dependent serotonin transporter (SERT) | Solute carrier family 6 member 4
Type:
Multi-pass membrane protein
Mol. Mass.:
70322.51
Organism:
Homo sapiens (Human)
Description:
P31645
Residue:
630
  
Inhibitor
Name:
BDBM50124565
Synonyms:
CHEMBL353333 | methyl 3-(4-iodophenyl)-(2S,3S)-8-azabicyclo[3.2.1]octane-2-carboxylate
Type:
Small organic molecule
Emp. Form.:
C15H18INO2
Mol. Mass.:
371.2134
SMILES:
COC(=O)[C@@H]1C2CCC(C[C@@H]1c1ccc(I)cc1)N2
: