Target
Bifunctional dihydrofolate reductase-thymidylate synthase
Ligand
BDBM18512
Substrate
Meas. Tech.
ChEMBL_55433 (CHEMBL667626)
Ki
380±n/a nM
Citation
 Rastelli, GPacchioni, SSirawaraporn, WSirawaraporn, RParenti, MDFerrari, AM Docking and database screening reveal new classes of Plasmodium falciparum dihydrofolate reductase inhibitors. J Med Chem 46:2834-45 (2003)  
Target
Name:
Bifunctional dihydrofolate reductase-thymidylate synthase
Synonyms:
DHFR-TS Dihydrofolate Reductase-Thymidylate Synthase (DHFR-TS) Mutant KICB1 PfDHFR-TS double mutant (C59R+S108N)
Type:
Enzyme
Mol. Mass.:
71822.51
Organism:
Plasmodium falciparum (isolate K1 / Thailand)
Description:
The mutant clone was prepared by cassette mutagenesis using wildtype pfDHFR as a template, and expressed in E. coli.
Residue:
608
  
Inhibitor
Name:
BDBM18512
Synonyms:
5-(4-chlorophenyl)-6-ethylpyrimidine-2,4-diamine Pyrimethamine (Pyr) cid_4993
Type:
Small organic molecule
Emp. Form.:
C12H13ClN4
Mol. Mass.:
248.711
SMILES:
CCc1nc(N)nc(N)c1-c1ccc(Cl)cc1
: