Target
5-hydroxytryptamine receptor 1B
Ligand
BDBM50130438
Substrate
Meas. Tech.
ChEMBL_1355 (CHEMBL616540)
Ki
3.2±n/a nM
Citation
 Filla, SAMathes, BMJohnson, KWPhebus, LACohen, MLNelson, DLZgombick, JMErickson, JASchenck, KWWainscott, DBBranchek, TASchaus, JM Novel potent 5-HT(1F) receptor agonists: structure-activity studies of a series of substituted N-[3-(1-methyl-4-piperidinyl)-1H-pyrrolo[3,2-b]pyridin-5-yl]amides. J Med Chem 46:3060-71 (2003)  
Target
Name:
5-hydroxytryptamine receptor 1B
Synonyms:
5-HT-1B 5-HT1B 5HT1B_HUMAN HTR1DB Serotonin (5-HT) receptor Serotonin Receptor 1B
Type:
G Protein-Coupled Receptor (GPCR)
Mol. Mass.:
43579.17
Organism:
Homo sapiens (Human)
Description:
Receptor binding assays were performed using human clone stably expressed in CHO cells
Residue:
390
  
Inhibitor
Name:
BDBM50130438
Synonyms:
1-(4-Fluoro-phenyl)-3-[3-(1-methyl-piperidin-4-yl)-1H-pyrrolo[3,2-b]pyridin-5-yl]-urea | CHEMBL105369
Type:
Small organic molecule
Emp. Form.:
C20H22FN5O
Mol. Mass.:
367.42
SMILES:
CN1CCC(CC1)c1c[nH]c2ccc(NC(=O)Nc3ccc(F)cc3)nc12
: