Target
Tyrosine-protein phosphatase non-receptor type 1
Ligand
BDBM50131554
Substrate
Meas. Tech.
ChEMBL_162274 (CHEMBL770822)
Kd
15600000±n/a nM
Citation
 Liu, GXin, ZLiang, HAbad-Zapatero, CHajduk, PJJanowick, DASzczepankiewicz, BGPei, ZHutchins, CWBallaron, SJStashko, MALubben, THBerg, CERondinone, CMTrevillyan, JMJirousek, MR Selective protein tyrosine phosphatase 1B inhibitors: targeting the second phosphotyrosine binding site with non-carboxylic acid-containing ligands. J Med Chem 46:3437-40 (2003)  
Target
Name:
Tyrosine-protein phosphatase non-receptor type 1
Synonyms:
PTN1_HUMAN PTPN1 Protein tyrosine phosphatase-1B (PTP1B) Protein-tyrosine phosphatase 1B (PTP1B) Tyrosine-protein phosphatase non-receptor type 1 (PTP1B)
Type:
Protein phosphatase
Mol. Mass.:
49963.76
Organism:
Homo sapiens (Human)
Description:
Human recombinant GST-fusion PTP1B (1-435).
Residue:
435
  
Inhibitor
Name:
BDBM50131554
Synonyms:
5-Hydroxy-6,8-dimethyl-quinoline-2-carboxylic acid | CHEMBL116128
Type:
Small organic molecule
Emp. Form.:
C12H11NO3
Mol. Mass.:
217.2206
SMILES:
Cc1cc(C)c2nc(ccc2c1O)C(O)=O
: