Target
Mitogen-activated protein kinase 14
Ligand
BDBM14837
Substrate
Meas. Tech.
ChEMBL_124492 (CHEMBL733328)
Kd
1.1±n/a nM
Citation
 Regan, JPargellis, CACirillo, PFGilmore, THickey, ERPeet, GWProto, ASwinamer, AMoss, N The kinetics of binding to p38MAP kinase by analogues of BIRB 796. Bioorg Med Chem Lett 13:3101-4 (2003)  
Target
Name:
Mitogen-activated protein kinase 14
Synonyms:
CSAID-binding protein CSBP1 CSPB1 MAP kinase 14 MAP kinase p38 alpha MAPK14 MK14_HUMAN Mitogen-activated protein kinase p38 alpha Stress-activated protein kinase 2a | p38 MAP kinase alpha/beta
Type:
Serine/threonine-protein kinase
Mol. Mass.:
41286.76
Organism:
Homo sapiens (Human)
Description:
Q16539
Residue:
360
  
Inhibitor
Name:
BDBM14837
Synonyms:
3-[3-tert-butyl-1-(4-methylphenyl)-1H-pyrazol-5-yl]-1-naphthalen-1-ylurea CHEMBL420047 | diaryl urea compound 6
Type:
Small organic molecule
Emp. Form.:
C25H26N4O
Mol. Mass.:
398.5001
SMILES:
Cc1ccc(cc1)-n1nc(cc1NC(=O)Nc1cccc2ccccc12)C(C)(C)C
: