Target
Peptidyl-prolyl cis-trans isomerase FKBP1A
Ligand
BDBM50132550
Substrate
Meas. Tech.
ChEBML_66292
IC50
8.2±n/a nM
Citation
 Yang, WKeenan, TPRozamus, LWWang, XRivera, VMRollins, CTClackson, THolt, DA Regulation of gene expression by synthetic dimerizers with novel specificity. Bioorg Med Chem Lett 13:3181-4 (2003)  
Target
Name:
Peptidyl-prolyl cis-trans isomerase FKBP1A
Synonyms:
12 kDa FK506-binding protein FK506-binding protein 1A FKB1A_HUMAN FKBP-1A FKBP12 Immunophilin FKBP12 PPIase FKBP1A Rotamase mTOR/FKBP12A/FKBP12B
Type:
Isomerase
Mol. Mass.:
11953.09
Organism:
Homo sapiens (Human)
Description:
P62942
Residue:
108
  
Inhibitor
Name:
BDBM50132550
Synonyms:
(S)-1-[(S)-2-(3,4,5-Trimethoxy-phenyl)-propionyl]-piperidine-2-carboxylic acid (R)-1-(3-carboxymethoxy-phenyl)-3-(3,4-dimethoxy-phenyl)-propyl ester | CHEMBL107101
Type:
Small organic molecule
Emp. Form.:
C37H45NO11
Mol. Mass.:
679.7533
SMILES:
COc1ccc(CC[C@@H](OC(=O)[C@@H]2CCCCN2C(=O)[C@@H](C)c2cc(OC)c(OC)c(OC)c2)c2cccc(OCC(O)=O)c2)cc1OC
: