Target
5-hydroxytryptamine receptor 1D
Ligand
BDBM50133451
Substrate
Meas. Tech.
ChEMBL_1718 (CHEMBL616924)
Ki
0.56±n/a nM
Citation
 Egle, IMacLean, NDemchyshyn, LEdwards, LSlassi, ATehim, A (R)-3-(N-methylpyrrolidin-2-ylmethyl)-5-(1,2,3,6-tetrahydropyridin-4-yl)-1H-indole derivatives as high affinity h5-HT1B/1D ligands. Bioorg Med Chem Lett 13:3419-21 (2003)  
Target
Name:
5-hydroxytryptamine receptor 1D
Synonyms:
5-HT-1D 5-HT1D 5HT1D_HUMAN HTR1DA Serotonin (5-HT) receptor | Serotonin Receptor 1D
Type:
G Protein-Coupled Receptor (GPCR)
Mol. Mass.:
41920.63
Organism:
Homo sapiens (Human)
Description:
Receptor binding assays were performed using human clone stably expressed in CHO cells.
Residue:
377
  
Inhibitor
Name:
BDBM50133451
Synonyms:
4-[3-((R)-1-Methyl-pyrrolidin-2-ylmethyl)-1H-indol-5-yl]-3,6-dihydro-2H-pyridine-1-carbothioic acid (4-chloro-phenyl)-amide | CHEMBL115663
Type:
Small organic molecule
Emp. Form.:
C26H29ClN4S
Mol. Mass.:
465.053
SMILES:
CN1CCC[C@@H]1Cc1c[nH]c2ccc(cc12)C1=CCN(CC1)C(=S)Nc1ccc(Cl)cc1
: