Target
Beta-galactosidase
Ligand
BDBM50133504
Substrate
Meas. Tech.
ChEMBL_37275 (CHEMBL656025)
Ki
46±n/a nM
Citation
 Ogawa, SFujieda, SSakata, YIshizaki, MHisamatsu, SOkazaki, K Synthesis and glycosidase inhibitory activity of some N-substituted 6-deoxy-5a-carba-beta-DL- and L-galactopyranosylamines. Bioorg Med Chem Lett 13:3461-3 (2003)  
Target
Name:
Beta-galactosidase
Synonyms:
β-galactosidase Beta-galactosidase/Glucosylceramidase | GLB1
Type:
Protein
Mol. Mass.:
73420.88
Organism:
Bos taurus (Bovine)
Description:
Residue:
653
  
Inhibitor
Name:
BDBM50133504
Synonyms:
4-Methyl-6-(4-phenyl-butylamino)-cyclohexane-1,2,3-triol | CHEMBL324840
Type:
Small organic molecule
Emp. Form.:
C17H27NO3
Mol. Mass.:
293.4012
SMILES:
CC1CC(NCCCCc2ccccc2)C(O)C(O)C1O
: