Target
Cruzipain
Ligand
BDBM50133625
Substrate
Meas. Tech.
ChEMBL_210992 (CHEMBL812106)
IC50
90000±n/a nM
Citation
 Chiyanzu, IHansell, EGut, JRosenthal, PJMcKerrow, JHChibale, K Synthesis and evaluation of isatins and thiosemicarbazone derivatives against cruzain, falcipain-2 and rhodesain. Bioorg Med Chem Lett 13:3527-30 (2003)  
Target
Name:
Cruzipain
Synonyms:
CYSP_TRYCR Cruzaine | Major cysteine proteinase
Type:
Protein
Mol. Mass.:
49831.41
Organism:
Trypanosoma cruzi
Description:
P25779
Residue:
467
  
Inhibitor
Name:
BDBM50133625
Synonyms:
1-Benzyl-5-chloro-1H-indole-2,3-dione | CHEMBL336693
Type:
Small organic molecule
Emp. Form.:
C15H10ClNO2
Mol. Mass.:
271.698
SMILES:
Clc1ccc2N(Cc3ccccc3)C(=O)C(=O)c2c1
: