Target
5'-methylthioadenosine/S-adenosylhomocysteine nucleosidase
Ligand
BDBM50136909
Substrate
Meas. Tech.
ChEMBL_103130 (CHEMBL712301)
Ki
6500±n/a nM
Citation
 Li, XChu, SFeher, VAKhalili, MNie, ZMargosiak, SNikulin, VLevin, JSprankle, KGTedder, MEAlmassy, RAppelt, KYager, KM Structure-based design, synthesis, and antimicrobial activity of indazole-derived SAH/MTA nucleosidase inhibitors. J Med Chem 46:5663-73 (2003)  
Target
Name:
5'-methylthioadenosine/S-adenosylhomocysteine nucleosidase
Synonyms:
5 -methylthioadenosine nucleosidase 5'-methylthioadenosine/S-adenosylhomocysteine nucleosidase MTA/SAH nucleosidase MTNN_ECOLI P46 mtn pfs | yadA
Type:
Enzyme
Mol. Mass.:
24347.14
Organism:
Escherichia coli (strain K12)
Description:
P0AF12
Residue:
232
  
Inhibitor
Name:
BDBM50136909
Synonyms:
4-Chloro-N-[3-chloro-7-(3,3-dimethyl-butylamino)-1H-indazol-5-yl]-benzenesulfonamide | CHEMBL157165
Type:
Small organic molecule
Emp. Form.:
C19H22Cl2N4O2S
Mol. Mass.:
441.375
SMILES:
CC(C)(C)CCNc1cc(NS(=O)(=O)c2ccc(Cl)cc2)cc2c(Cl)[nH]nc12
: