Target
5'-methylthioadenosine/S-adenosylhomocysteine nucleosidase
Ligand
BDBM50136912
Substrate
Meas. Tech.
ChEMBL_103130 (CHEMBL712301)
Ki
5200±n/a nM
Citation
 Li, XChu, SFeher, VAKhalili, MNie, ZMargosiak, SNikulin, VLevin, JSprankle, KGTedder, MEAlmassy, RAppelt, KYager, KM Structure-based design, synthesis, and antimicrobial activity of indazole-derived SAH/MTA nucleosidase inhibitors. J Med Chem 46:5663-73 (2003)  
Target
Name:
5'-methylthioadenosine/S-adenosylhomocysteine nucleosidase
Synonyms:
5 -methylthioadenosine nucleosidase 5'-methylthioadenosine/S-adenosylhomocysteine nucleosidase MTA/SAH nucleosidase MTNN_ECOLI P46 mtn pfs | yadA
Type:
Enzyme
Mol. Mass.:
24347.14
Organism:
Escherichia coli (strain K12)
Description:
P0AF12
Residue:
232
  
Inhibitor
Name:
BDBM50136912
Synonyms:
4-Chloro-N-(3-chloro-1H-indazol-5-yl)-benzenesulfonamide | CHEMBL348866
Type:
Small organic molecule
Emp. Form.:
C13H9Cl2N3O2S
Mol. Mass.:
342.2
SMILES:
Clc1n[nH]c2ccc(NS(=O)(=O)c3ccc(Cl)cc3)cc12
: