Target
5'-methylthioadenosine/S-adenosylhomocysteine nucleosidase
Ligand
BDBM50136935
Substrate
Meas. Tech.
ChEMBL_103130 (CHEMBL712301)
Ki
17±n/a nM
Citation
 Li, XChu, SFeher, VAKhalili, MNie, ZMargosiak, SNikulin, VLevin, JSprankle, KGTedder, MEAlmassy, RAppelt, KYager, KM Structure-based design, synthesis, and antimicrobial activity of indazole-derived SAH/MTA nucleosidase inhibitors. J Med Chem 46:5663-73 (2003)  
Target
Name:
5'-methylthioadenosine/S-adenosylhomocysteine nucleosidase
Synonyms:
5 -methylthioadenosine nucleosidase 5'-methylthioadenosine/S-adenosylhomocysteine nucleosidase MTA/SAH nucleosidase MTNN_ECOLI P46 mtn pfs | yadA
Type:
Enzyme
Mol. Mass.:
24347.14
Organism:
Escherichia coli (strain K12)
Description:
P0AF12
Residue:
232
  
Inhibitor
Name:
BDBM50136935
Synonyms:
3'-Methylsulfanyl-biphenyl-3-sulfonic acid (3-chloro-7-isobutylamino-1H-indazol-5-yl)-amide | CHEMBL153941
Type:
Small organic molecule
Emp. Form.:
C24H25ClN4O2S2
Mol. Mass.:
501.064
SMILES:
CSc1cccc(c1)-c1cccc(c1)S(=O)(=O)Nc1cc(NCC(C)C)c2[nH]nc(Cl)c2c1
: