Target
3-dehydroquinate dehydratase
Ligand
BDBM50137054
Substrate
Meas. Tech.
ChEMBL_213120 (CHEMBL818199)
Ki
200000±n/a nM
Citation
 González-Bello, CLence, EToscano, MDCastedo, LCoggins, JRAbell, C Parallel solid-phase synthesis and evaluation of inhibitors of Streptomyces coelicolor type II dehydroquinase. J Med Chem 46:5735-44 (2003)  
Target
Name:
3-dehydroquinate dehydratase
Synonyms:
AROQ_STRCO | aroQ
Type:
PROTEIN
Mol. Mass.:
16681.13
Organism:
Streptomyces coelicolor
Description:
ChEMBL_332877
Residue:
157
  
Inhibitor
Name:
BDBM50137054
Synonyms:
(1R,4R,5R)-1,5-Dihydroxy-4-(4-nitro-benzyloxy)-cyclohex-2-enecarboxylic acid | CHEMBL152151
Type:
Small organic molecule
Emp. Form.:
C14H15NO7
Mol. Mass.:
309.2714
SMILES:
O[C@@H]1C[C@@](O)(C=C[C@H]1OCc1ccc(cc1)[N+]([O-])=O)C(O)=O
: