Target
3-dehydroquinate dehydratase
Ligand
BDBM50137060
Substrate
Meas. Tech.
ChEMBL_213120 (CHEMBL818199)
Ki
330000±n/a nM
Citation
 González-Bello, CLence, EToscano, MDCastedo, LCoggins, JRAbell, C Parallel solid-phase synthesis and evaluation of inhibitors of Streptomyces coelicolor type II dehydroquinase. J Med Chem 46:5735-44 (2003)  
Target
Name:
3-dehydroquinate dehydratase
Synonyms:
AROQ_STRCO | aroQ
Type:
PROTEIN
Mol. Mass.:
16681.13
Organism:
Streptomyces coelicolor
Description:
ChEMBL_332877
Residue:
157
  
Inhibitor
Name:
BDBM50137060
Synonyms:
(1R,4R,5R)-4-(4-Cyano-benzyloxy)-1,5-dihydroxy-cyclohex-2-enecarboxylic acid | CHEMBL157011
Type:
Small organic molecule
Emp. Form.:
C15H15NO5
Mol. Mass.:
289.2833
SMILES:
O[C@@H]1C[C@@](O)(C=C[C@H]1OCc1ccc(cc1)C#N)C(O)=O
: