Target
3-dehydroquinate dehydratase
Ligand
BDBM50137063
Substrate
Meas. Tech.
ChEMBL_213120 (CHEMBL818199)
Ki
375000±n/a nM
Citation
 González-Bello, CLence, EToscano, MDCastedo, LCoggins, JRAbell, C Parallel solid-phase synthesis and evaluation of inhibitors of Streptomyces coelicolor type II dehydroquinase. J Med Chem 46:5735-44 (2003)  
Target
Name:
3-dehydroquinate dehydratase
Synonyms:
AROQ_STRCO | aroQ
Type:
PROTEIN
Mol. Mass.:
16681.13
Organism:
Streptomyces coelicolor
Description:
ChEMBL_332877
Residue:
157
  
Inhibitor
Name:
BDBM50137063
Synonyms:
(1R,4R,5R)-1-(4-Fluoro-benzyloxy)-4,5-dihydroxy-cyclohex-2-enecarboxylic acid | CHEMBL351326
Type:
Small organic molecule
Emp. Form.:
C14H15FO5
Mol. Mass.:
282.2643
SMILES:
O[C@@H]1C[C@@](OCc2ccc(F)cc2)(C=C[C@H]1O)C(O)=O
: