Target
Chymotrypsinogen A
Ligand
BDBM50137732
Substrate
Meas. Tech.
ChEBML_49467
Ki
62±n/a nM
Citation
 Victor, FLamar, JSnyder, NYip, YGuo, DYumibe, NJohnson, RBWang, QMGlass, JIChen, SH P1 and P3 optimization of novel bicycloproline P2 bearing tetrapeptidyl alpha-ketoamide based HCV protease inhibitors. Bioorg Med Chem Lett 14:257-61 (2003)  
Target
Name:
Chymotrypsinogen A
Synonyms:
Alpha-chymotrypsin Chymotrypsin A Chymotrypsin A chain B Chymotrypsinogen A | alpha-Chymotrypsin (α-Chymotrypsin)
Type:
Serine protease
Mol. Mass.:
25670.88
Organism:
Bos taurus (bovine)
Description:
Residue:
245
  
Inhibitor
Name:
BDBM50137732
Synonyms:
(1S,5S,6R)-2-((S)-3,3-Dimethyl-2-{(S)-3-methyl-2-[(pyrazine-2-carbonyl)-amino]-butyrylamino}-butyryl)-octahydro-cyclopenta[c]pyrrole-1-carboxylic acid [1-((S)-(S)-1-phenyl-ethylaminooxalyl)-butyl]-amide | CHEMBL87150
Type:
Small organic molecule
Emp. Form.:
C38H53N7O6
Mol. Mass.:
703.8707
SMILES:
CCC[C@H](NC(=O)[C@@H]1[C@H]2CCC[C@H]2CN1C(=O)[C@@H](NC(=O)[C@@H](NC(=O)c1cnccn1)C(C)C)C(C)(C)C)C(=O)C(=O)N[C@@H](C)c1ccccc1
: