Target
RNA-directed RNA polymerase
Ligand
BDBM50137853
Substrate
Meas. Tech.
ChEBML_163993
IC50
5000±n/a nM
Citation
 Summa, VPetrocchi, APace, PMatassa, VGDe Francesco, RAltamura, STomei, LKoch, UNeuner, P Discovery of alpha,gamma-diketo acids as potent selective and reversible inhibitors of hepatitis C virus NS5b RNA-dependent RNA polymerase. J Med Chem 47:14-7 (2003)  
Target
Name:
RNA-directed RNA polymerase
Synonyms:
Hepatitis C virus NS5B RNA-dependent RNA polymerase | NS5B protein
Type:
Protein
Mol. Mass.:
25173.95
Organism:
Hepatitis C virus
Description:
Q8JXU8
Residue:
229
  
Inhibitor
Name:
BDBM50137853
Synonyms:
2,4-Dioxo-4-p-tolyl-butyric acid CHEMBL175011 | Sacchettini_8
Type:
Small organic molecule
Emp. Form.:
C11H10O4
Mol. Mass.:
206.1947
SMILES:
Cc1ccc(cc1)C(=O)CC(=O)C(O)=O
: