Target
Cytochrome P450 2C19
Ligand
BDBM50138232
Substrate
Meas. Tech.
ChEMBL_51522 (CHEMBL660382)
IC50
<46±n/a nM
Citation
 Nakamura, TKakinuma, HUmemiya, HAmada, HMiyata, NTaniguchi, KBando, KSato, M Imidazole derivatives as new potent and selective 20-HETE synthase inhibitors. Bioorg Med Chem Lett 14:333-6 (2003)  
Target
Name:
Cytochrome P450 2C19
Synonyms:
CP2CJ_HUMAN CYPIIC17 Cytochrome P450 2C19 (CYP2C19) Mephenytoin 4-hydroxylase P450-254C
Type:
Enzyme
Mol. Mass.:
55935.47
Organism:
Homo sapiens (Human)
Description:
P33261
Residue:
490
  
Inhibitor
Name:
BDBM50138232
Synonyms:
2-(4-Imidazol-1-yl-phenoxymethyl)-pyridine | CHEMBL112592
Type:
Small organic molecule
Emp. Form.:
C15H13N3O
Mol. Mass.:
251.2832
SMILES:
C(Oc1ccc(cc1)-n1ccnc1)c1ccccn1
: