Target
Substance-K receptor
Ligand
BDBM50138823
Substrate
Meas. Tech.
ChEMBL_209042 (CHEMBL815488)
Ki
23±n/a nM
Citation
 Albert, JSOhnmacht, CBernstein, PRRumsey, WLAharony, DAlelyunas, YRussell, DJPotts, WSherwood, SAShen, LDedinas, RFPalmer, WERussell, K Structural analysis and optimization of NK(1) receptor antagonists through modulation of atropisomer interconversion properties. J Med Chem 47:519-29 (2004)  
Target
Name:
Substance-K receptor
Synonyms:
NK-2 receptor NK2R NKNAR Neurokinin A receptor Neurokinin-2 (NK-2) SKR TACR2 Tachykinin receptor 2 (NK2) | hnk-3
Type:
Protein
Mol. Mass.:
44455.78
Organism:
Homo sapiens (Human)
Description:
P21452
Residue:
398
  
Inhibitor
Name:
BDBM50138823
Synonyms:
3-Cyano-2-ethyl-naphthalene-1-carboxylic acid ((S)-2-(3,4-dichloro-phenyl)-4-{4-[2-((S)-methanesulfinyl)-phenyl]-piperidin-1-yl}-butyl)-methyl-amide | CHEMBL149326
Type:
Small organic molecule
Emp. Form.:
C37H39Cl2N3O2S
Mol. Mass.:
660.695
SMILES:
CCc1c(cc2ccccc2c1C(=O)N(C)C[C@@H](CCN1CCC(CC1)c1ccccc1[S@](C)=O)c1ccc(Cl)c(Cl)c1)C#N
: