Target
Substance-P receptor
Ligand
BDBM50138823
Substrate
Meas. Tech.
ChEMBL_205881 (CHEMBL813942)
Ki
2.94±n/a nM
Citation
 Albert, JSOhnmacht, CBernstein, PRRumsey, WLAharony, DAlelyunas, YRussell, DJPotts, WSherwood, SAShen, LDedinas, RFPalmer, WERussell, K Structural analysis and optimization of NK(1) receptor antagonists through modulation of atropisomer interconversion properties. J Med Chem 47:519-29 (2004)  
Target
Name:
Substance-P receptor
Synonyms:
NK-1 receptor NK1 Receptor NK1R_HUMAN Neurokinin-1 (NK-1) SPR TACR1 Tachykinin receptor 1 (NK1) | tachykinin
Type:
G Protein-Coupled Receptor (GPCR)
Mol. Mass.:
46254.43
Organism:
Homo sapiens (Human)
Description:
P25103
Residue:
407
  
Inhibitor
Name:
BDBM50138823
Synonyms:
3-Cyano-2-ethyl-naphthalene-1-carboxylic acid ((S)-2-(3,4-dichloro-phenyl)-4-{4-[2-((S)-methanesulfinyl)-phenyl]-piperidin-1-yl}-butyl)-methyl-amide | CHEMBL149326
Type:
Small organic molecule
Emp. Form.:
C37H39Cl2N3O2S
Mol. Mass.:
660.695
SMILES:
CCc1c(cc2ccccc2c1C(=O)N(C)C[C@@H](CCN1CCC(CC1)c1ccccc1[S@](C)=O)c1ccc(Cl)c(Cl)c1)C#N
: