Target
ATP-binding cassette sub-family C member 8/ATP-sensitive inward rectifier potassium channel 11
Ligand
BDBM50139706
Substrate
Meas. Tech.
ChEMBL_92519 (CHEMBL700928)
EC50
70±n/a nM
Citation
 Peat, AJTownsend, CCraig McKay, MGarrido, DTerry, CMWilson, JLThomson, SA 3-trifluoromethyl-4-nitro-5-arylpyrazoles are novel K(ATP) channel agonists. Bioorg Med Chem Lett 14:813-6 (2004)  
Target
Name:
ATP-binding cassette sub-family C member 8/ATP-sensitive inward rectifier potassium channel 11
Synonyms:
Potassium channel, inwardly rectifying, subfamily J, member 11/Sulfonylurea receptor 1 | Sulfonylurea receptor 1, Kir6.2
Type:
Mol. Mass.:
Description:
ASSAY_ID of EBI is 39363
Components:
This complex has 2 components.
Component 1
Name:
ATP-binding cassette sub-family C member 8
Synonyms:
ABCC8 ATP-binding cassette sub-family C member 8 HRINS SUR Sulfonylurea receptor 1 | Sulfonylurea receptors
Type:
PROTEIN
Mol. Mass.:
177013.37
Organism:
Homo sapiens (Human)
Description:
ChEMBL_1436733
Residue:
1581
  
Component 2
Name:
ATP-sensitive inward rectifier potassium channel 11
Synonyms:
ATP-sensitive inward rectifier potassium channel 11 Inward rectifier K(+) channel Kir6.2 KCNJ11 Potassium channel, inwardly rectifying, subfamily J, member 11 Sulfonylurea receptor 2, Kir6.2
Type:
Enzyme Catalytic Domain
Mol. Mass.:
43549.41
Organism:
Homo sapiens (Human)
Description:
Potassium channel (ATP modulatory) 0 0::Q14654
Residue:
390
  
Component 3
Name:
ATP-binding cassette sub-family C member 8
Synonyms:
ABCC8 ATP-binding cassette sub-family C member 8 HRINS SUR Sulfonylurea receptor 1 | Sulfonylurea receptors
Type:
PROTEIN
Mol. Mass.:
177013.37
Organism:
Homo sapiens (Human)
Description:
ChEMBL_1436733
Residue:
1581
  
Inhibitor
Name:
BDBM50139706
Synonyms:
3-(2,4-Dinitro-phenyl)-4-nitro-5-trifluoromethyl-1H-pyrazole | CHEMBL354554
Type:
Small organic molecule
Emp. Form.:
C10H4F3N5O6
Mol. Mass.:
347.1639
SMILES:
[O-][N+](=O)c1c(n[nH]c1C(F)(F)F)-c1ccc(cc1[N+]([O-])=O)[N+]([O-])=O
: