Target
Histone deacetylase 2b
Ligand
BDBM50139950
Substrate
Meas. Tech.
ChEMBL_87549 (CHEMBL695147)
IC50
17100±n/a nM
Citation
 Mai, AMassa, SCerbara, IValente, SRagno, RBottoni, PScatena, RLoidl, PBrosch, G 3-(4-Aroyl-1-methyl-1H-2-pyrrolyl)-N-hydroxy-2-propenamides as a new class of synthetic histone deacetylase inhibitors. 2. Effect of pyrrole-C2 and/or -C4 substitutions on biological activity. J Med Chem 47:1098-109 (2004)  
Target
Name:
Histone deacetylase 2b
Synonyms:
Histone deacetylase HD2
Type:
PROTEIN
Mol. Mass.:
30785.07
Organism:
Zea mays
Description:
ChEMBL_87549
Residue:
286
  
Inhibitor
Name:
BDBM50139950
Synonyms:
CHEMBL422390 | N-Hydroxy-2-(1-methyl-5-phenylacetyl-1H-pyrrol-2-yl)-acetamide
Type:
Small organic molecule
Emp. Form.:
C15H16N2O3
Mol. Mass.:
272.2991
SMILES:
Cn1c(CC(=O)NO)ccc1C(=O)Cc1ccccc1
: