Target
Sodium-dependent serotonin transporter
Ligand
BDBM50139956
Substrate
Meas. Tech.
ChEMBL_201479 (CHEMBL804588)
Ki
0.04±n/a nM
Citation
 Plisson, CMcConathy, JMartarello, LMalveaux, EJCamp, VMWilliams, LVotaw, JRGoodman, MM Synthesis, radiosynthesis, and biological evaluation of carbon-11 and iodine-123 labeled 2beta-carbomethoxy-3beta-[4'-((Z)-2-haloethenyl)phenyl]tropanes: candidate radioligands for in vivo imaging of the serotonin transporter. J Med Chem 47:1122-35 (2004)  
Target
Name:
Sodium-dependent serotonin transporter
Synonyms:
5-HT Transporter 5HTT SC6A4_HUMAN SLC6A4 Serotonin transporter (5HTT) Sodium-dependent serotonin transporter (SERT) | Solute carrier family 6 member 4
Type:
Multi-pass membrane protein
Mol. Mass.:
70322.51
Organism:
Homo sapiens (Human)
Description:
P31645
Residue:
630
  
Inhibitor
Name:
BDBM50139956
Synonyms:
3-[4-((Z)-2-Bromo-vinyl)-phenyl]-8-aza-bicyclo[3.2.1]octane-2-carboxylic acid methyl ester | CHEMBL14531
Type:
Small organic molecule
Emp. Form.:
C17H20BrNO2
Mol. Mass.:
350.25
SMILES:
COC(=O)C1C2CCC(CC1c1ccc(\C=C/Br)cc1)N2
: