Target
G2/mitotic-specific cyclin-B1
Ligand
BDBM50409922
Substrate
Meas. Tech.
ChEMBL_144034 (CHEMBL872836)
IC50
836±n/a nM
Citation
 Loughnan, MLNicke, AJones, AAdams, DJAlewood, PFLewis, RJ Chemical and functional identification and characterization of novel sulfated alpha-conotoxins from the cone snail Conus anemone. J Med Chem 47:1234-41 (2004)  
Target
Name:
G2/mitotic-specific cyclin-B1
Synonyms:
CCNB1_RAT G2/mitotic-specific cyclin B1 | G2/mitotic-specific cyclin-B1
Type:
PROTEIN
Mol. Mass.:
47397.83
Organism:
Rattus norvegicus
Description:
ChEMBL_144034
Residue:
423
  
Inhibitor
Name:
BDBM50409922
Synonyms:
CHEMBL2092998
Type:
Small organic molecule
Emp. Form.:
C65H97N23O27S5
Mol. Mass.:
1792.929
SMILES:
C[C@H](NC(=O)[C@H](CS)NC(=O)[C@H](C)NC(=O)[C@H]1CCCN1C(=O)[C@H](Cc1cnc[nH]1)NC(=O)[C@H](CO)NC(=O)[C@H](CS)NC(=O)[C@H](CS)NC(=O)CNC(=O)CN)C(=O)N[C@@H](C)C(=O)N[C@@H](CC(N)=O)C(=O)N[C@@H](CC(N)=O)C(=O)N[C@@H](CCC(N)=O)C(=O)N[C@@H](CC(O)=O)C(=O)N[C@@H](Cc1ccc(OS(O)(=O)=O)cc1)C(=O)N[C@@H](CS)C(N)=O
: